{"text_format":"1","workbook":"xlsx","n_sheets":3,"sheets":["Calendar","Weeks Calendar","Copy"],"not_rendered":{"charts":0,"images":4,"macros":1,"external_links":0,"defined_names":44,"comments":0,"pivot_tables":0},"unopened":[],"bounds":{"document_bytes":16777216,"sheet_cells":100000,"rows_first":2000,"rows_last":500,"rows_between":2000,"halvings":0,"cell_chars":16384,"cell_head_chars":4096},"cells_cut":0,"cells_raw":0,"read":"whole","date_system":"1900"}

{"sheet":"Calendar","index":0,"n_rows":42,"n_cols":11,"rows_kept":42,"cut":false,"hidden":false,"merged":[[1,3,1,6],[1,7,3,7],[41,0,42,0],[2,6,3,6],[2,3,3,5],[41,1,42,2],[41,6,42,7],[41,3,42,5],[2,1,3,2],[1,1,1,2]]}
[null,null,null,"Age Group:"]
[null,"School Name",null,null,null,null,null,{"$f":"IF(ISBLANK($E$1),\"\",$E$1)","v":""}]
[null,"District Number",null,"August",null,null,2021,null,null,{"$f":"DATE($G$3,MONTH(DATEVALUE(D3&\" 1\")),1)","v":"2021-08-01"},{"$f":"TEXT((DATE($G$3,MONTH(DATEVALUE(D3&\" 1\")),1)),\"DDD\")","v":"Sun"}]
[null,null,null,null,null,null,null,null,null,{"$f":"VALUE(TEXT(EOMONTH(J3,0),\"DD\"))","v":31},{"$f":"MONTH(DATEVALUE(D3&\" 1\"))","v":8}]
[null,"Sun","Mon","Tue","Wed","Thu","Fri","Sat"]
[null,{"$f":"IFERROR(IF($K$3=B5,1,\"\"),\"\")","v":"1900-01-01"},{"$f":"IFERROR(IF($K$3=C5,1,IF(B6=\"\",\"\",B6+1)),\"\")","v":"1900-01-02"},"1900-01-03","1900-01-04","1900-01-05","1900-01-06","1900-01-07"]
["----->"]
["Use This Cell",{"$f":"IFERROR(INDEX('Weeks Calendar'!$C$6:$I$10,2,MATCH(B7,'Weeks Calendar'!$C$6:$I$6,0)),\"\")&\nIFERROR(INDEX('Weeks Calendar'!$C$12:$I$16,2,MATCH(B7,'Weeks Calendar'!$C$12:$I$12,0)),\"\")&\nIFERROR(INDEX('Weeks Calendar'!$C$18:$I$22,2,MATCH(B7,'Weeks Calendar'!$C$18:$I$18,0)),\"\")&\nIFERROR(INDEX('Weeks Calendar'!$C$24:$I$28,2,MATCH(B7,'Weeks Calendar'!$C$24:$I$24,0)),\"\")&\nIFERROR(INDEX('Weeks Calendar'!$C$24:$I$28,2,MATCH(B7,'Weeks Calendar'!$C$30:$I$30,0)),\"\")","v":""},{"$f":"IFERROR(INDEX('Weeks Calendar'!$C$6:$I$10,2,MATCH(C7,'Weeks Calendar'!$C$6:$I$6,0)),\"\")&\nIFERROR(INDEX('Weeks Calendar'!$C$12:$I$16,2,MATCH(C7,'Weeks Calendar'!$C$12:$I$12,0)),\"\")&\nIFERROR(INDEX('Weeks Calendar'!$C$18:$I$22,2,MATCH(C7,'Weeks Calendar'!$C$18:$I$18,0)),\"\")&\nIFERROR(INDEX('Weeks Calendar'!$C$24:$I$28,2,MATCH(C7,'Weeks Calendar'!$C$24:$I$24,0)),\"\")&\nIFERROR(INDEX('Weeks Calendar'!$C$24:$I$28,2,MATCH(C7,'Weeks Calendar'!$C$30:$I$30,0)),\"\")","v":""},{"$f":"IFERROR(INDEX('Weeks Calendar'!$C$6:$I$10,2,MATCH(D7,'Weeks Calendar'!$C$6:$I$6,0)),\"\")&\nIFERROR(INDEX('Weeks Calendar'!$C$12:$I$16,2,MATCH(D7,'Weeks Calendar'!$C$12:$I$12,0)),\"\")&\nIFERROR(INDEX('Weeks Calendar'!$C$18:$I$22,2,MATCH(D7,'Weeks Calendar'!$C$18:$I$18,0)),\"\")&\nIFERROR(INDEX('Weeks Calendar'!$C$24:$I$28,2,MATCH(D7,'Weeks Calendar'!$C$24:$I$24,0)),\"\")&\nIFERROR(INDEX('Weeks Calendar'!$C$24:$I$28,2,MATCH(D7,'Weeks Calendar'!$C$30:$I$30,0)),\"\")","v":""},{"$f":"IFERROR(INDEX('Weeks Calendar'!$C$6:$I$10,2,MATCH(E7,'Weeks Calendar'!$C$6:$I$6,0)),\"\")&\nIFERROR(INDEX('Weeks Calendar'!$C$12:$I$16,2,MATCH(E7,'Weeks Calendar'!$C$12:$I$12,0)),\"\")&\nIFERROR(INDEX('Weeks Calendar'!$C$18:$I$22,2,MATCH(E7,'Weeks Calendar'!$C$18:$I$18,0)),\"\")&\nIFERROR(INDEX('Weeks Calendar'!$C$24:$I$28,2,MATCH(E7,'Weeks Calendar'!$C$24:$I$24,0)),\"\")&\nIFERROR(INDEX('Weeks Calendar'!$C$24:$I$28,2,MATCH(E7,'Weeks Calendar'!$C$30:$I$30,0)),\"\")","v":""},{"$f":"IFERROR(INDEX('Weeks Calendar'!$C$6:$I$10,2,MATCH(F7,'Weeks Calendar'!$C$6:$I$6,0)),\"\")&\nIFERROR(INDEX('Weeks Calendar'!$C$12:$I$16,2,MATCH(F7,'Weeks Calendar'!$C$12:$I$12,0)),\"\")&\nIFERROR(INDEX('Weeks Calendar'!$C$18:$I$22,2,MATCH(F7,'Weeks Calendar'!$C$18:$I$18,0)),\"\")&\nIFERROR(INDEX('Weeks Calendar'!$C$24:$I$28,2,MATCH(F7,'Weeks Calendar'!$C$24:$I$24,0)),\"\")&\nIFERROR(INDEX('Weeks Calendar'!$C$24:$I$28,2,MATCH(F7,'Weeks Calendar'!$C$30:$I$30,0)),\"\")","v":""},{"$f":"IFERROR(INDEX('Weeks Calendar'!$C$6:$I$10,2,MATCH(G7,'Weeks Calendar'!$C$6:$I$6,0)),\"\")&\nIFERROR(INDEX('Weeks Calendar'!$C$12:$I$16,2,MATCH(G7,'Weeks Calendar'!$C$12:$I$12,0)),\"\")&\nIFERROR(INDEX('Weeks Calendar'!$C$18:$I$22,2,MATCH(G7,'Weeks Calendar'!$C$18:$I$18,0)),\"\")&\nIFERROR(INDEX('Weeks Calendar'!$C$24:$I$28,2,MATCH(G7,'Weeks Calendar'!$C$24:$I$24,0)),\"\")&\nIFERROR(INDEX('Weeks Calendar'!$C$24:$I$28,2,MATCH(G7,'Weeks Calendar'!$C$30:$I$30,0)),\"\")","v":""},{"$f":"IFERROR(INDEX('Weeks Calendar'!$C$6:$I$10,2,MATCH(H7,'Weeks Calendar'!$C$6:$I$6,0)),\"\")&\nIFERROR(INDEX('Weeks Calendar'!$C$12:$I$16,2,MATCH(H7,'Weeks Calendar'!$C$12:$I$12,0)),\"\")&\nIFERROR(INDEX('Weeks Calendar'!$C$18:$I$22,2,MATCH(H7,'Weeks Calendar'!$C$18:$I$18,0)),\"\")&\nIFERROR(INDEX('Weeks Calendar'!$C$24:$I$28,2,MATCH(H7,'Weeks Calendar'!$C$24:$I$24,0)),\"\")&\nIFERROR(INDEX('Weeks Calendar'!$C$24:$I$28,2,MATCH(H7,'Weeks Calendar'!$C$30:$I$30,0)),\"\")","v":""}]
{"$rows_left_out":35}
{"sheet":"Weeks Calendar","index":1,"n_rows":244,"n_cols":90,"rows_kept":244,"cut":false,"hidden":true,"merged":[[2,23,2,25],[1,76,1,78],[1,85,1,87],[2,1,2,4],[2,5,2,7],[1,4,1,6],[1,13,1,15],[1,58,1,60],[1,67,1,69],[1,40,1,42],[1,49,1,51],[2,37,2,40],[2,41,2,43],[1,22,1,24],[1,31,1,33],[2,19,2,22]]}
["This institution is an equal opportunity employer and provider"]
[null,null,null,null,"CACFP 3-5 Planned Veggies (PV)",null,null,null,null,null,null,null,null,"CACFP 3-5 Veggie Bar (VB)",null,null,null,null,null,null,null,null,"CACFP 6-18 Planned Veggies (PV)",null,null,null,null,null,null,null,null,"CACFP 6-18 Veggie Bar (VB)",null,null,null,null,null,null,null,null,"CACFP Adult Planned Veggies (PV)",null,null,null,null,null,null,null,null,"CACFP Adult Veggie Bar (VB)",null,null,null,null,null,null,null,null,"K-8 Planned Veggies (PV)",null,null,null,null,null,null,null,null,"K-8 Veggie Bar (VB)",null,null,null,null,null,null,null,null,"9-12 Planned Veggies (PV)",null,null,null,null,null,null,null,null,"9-12 Veggie Bar (VB)"]
[]
["Choose Week",null,"Sun","Mon","Tue","Wed","Thu","Fri","Sat",null,null,"Sun","Mon","Tue","Wed","Thu","Fri","Sat",null,null,"Sun","Mon","Tue","Wed","Thu","Fri","Sat",null,null,"Sun","Mon","Tue","Wed","Thu","Fri","Sat",null,null,"Sun","Mon","Tue","Wed","Thu","Fri","Sat",null,null,"Sun","Mon","Tue","Wed","Thu","Fri","Sat",null,null,"Sun","Mon","Tue","Wed","Thu","Fri","Sat",null,null,"Sun","Mon","Tue","Wed","Thu","Fri","Sat",null,null,"Sun","Mon","Tue","Wed","Thu","Fri","Sat",null,null,"Sun","Mon","Tue","Wed","Thu","Fri","Sat"]
["_________","Week 1",null,"","","","","","",null,"Week 1",null,"","","","","","",null,"Week 1",null,"","","","","","",null,"Week 1",null,"","","","","","",null,"Week 1",null,"","","","","","",null,"Week 1",null,"","","","","","",null,"Week 1",null,"","","","","","",null,"Week 1",null,"","","","","","",null,"Week 1",null,{"$f":"\"\"","v":""},{"$f":"\"\"","v":""},{"$f":"\"\"","v":""},{"$f":"\"\"","v":""},{"$f":"\"\"","v":""},"",null,"Week 1",null,{"$f":"\"\"","v":""},{"$f":"\"\"","v":""},{"$f":"\"\"","v":""},{"$f":"\"\"","v":""},{"$f":"\"\"","v":""},""]
["Week 1",{"$f":"\"\"","v":""},null,"Ham & Swiss Sandwich","Turkey & Cheese Sandwich","Pastrami & Provalone Sandwich","Turkey Bagel Sandwich","Old Fashioned Chicken Wrap",null,null,{"$f":"\"\"","v":""},"Sausage, Egg & Cheese Sandwich","Crunchy Chicken Tender Wrap","Turkey Meatballs and Gravy","Fish Bites","Boneless Chicken Chompers","Teriyaki Chicken Bowl","Bean and Cheese Burrito",null,{"$f":"\"\"","v":""},"Sausage, Egg & Cheese Sandwich","Crunchy Chicken Tender Wrap","Turkey Meatballs and Gravy","Fish Bites","Boneless Chicken Chompers","Teriyaki Chicken Bowl","Bean and Cheese Burrito",null,{"$f":"\"\"","v":""},"Sausage, Egg & Cheese Sandwich","Crunchy Chicken Tender Wrap","Turkey Meatballs and Gravy","Fish Bites","Boneless Chicken Chompers","Teriyaki Chicken Bowl","Bean and Cheese Burrito",null,{"$f":"\"\"","v":""},"Sausage, Egg & Cheese Sandwich","Crunchy Chicken Tender Wrap","Turkey Meatballs and Gravy","Fish Bites","Boneless Chicken Chompers","Teriyaki Chicken Bowl","Bean and Cheese Burrito",null,{"$f":"\"\"","v":""},"Sausage, Egg & Cheese Sandwich","Crunchy Chicken Tender Wrap","Turkey Meatballs and Gravy","Fish Bites","Boneless Chicken Chompers","Teriyaki Chicken Bowl","Bean and Cheese Burrito",null,{"$f":"\"\"","v":""},"Sausage, Egg & Cheese Sandwich","Crunchy Chicken Tender Wrap","Turkey Meatballs and Gravy","Fish Bites","Boneless Chicken Chompers","Teriyaki Chicken Bowl","Bean and Cheese Burrito",null,{"$f":"\"\"","v":""},"Sausage, Egg & Cheese Sandwich","Crunchy Chicken Tender Wrap","Turkey Meatballs and Gravy","Fish Bites","Boneless Chicken Chompers","Teriyaki Chicken Bowl","Bean and Cheese Burrito",null,{"$f":"\"\"","v":""},"Sausage, Egg & Cheese Sandwich","Pastrami & Provalone Sandwich","Turkey Meatballs and Gravy","Fish Bites","Boneless Chicken Chompers","Teriyaki Chicken Bowl","Bean and Cheese Burrito",null,{"$f":"\"\"","v":""},"Sausage, Egg & Cheese Sandwich","Crunchy Chicken Tender Wrap","Turkey Meatballs and Gravy","Fish Bites","Boneless Chicken Chompers","Teriyaki Chicken Bowl","Bean and Cheese Burrito"]
["Week 2",{"$f":"\"\"","v":""},null,"Mayo Packet","Lettuce & Mayo","Mayo Packet","Cucumber & Dressing","Side Salad & Dressing",null,null,{"$f":"\"\"","v":""},"Salad Bar","Shredded Cheddar Cheese","Dinner Roll","Dinner Roll","Ketchup","Cilantro Brown Rice","Taco Sauce",null,{"$f":"\"\"","v":""},"Crispy Cubes & Ketchup","RanchaBoom! Sauce","Dinner Roll","Garlic Ranch","Ketchup","Cilantro Brown Rice","Cheddar Cheese & Taco Sauce",null,{"$f":"\"\"","v":""},"Salad Bar","Shredded Cheddar Cheese","Dinner Roll","Dinner Roll","Ketchup","Cilantro Brown Rice","Taco Sauce",null,{"$f":"\"\"","v":""},"Crispy Cubes & Ketchup","Shredded Cheddar Cheese","Dinner Roll","Dinner Roll","Ketchup","Cilantro Brown Rice","Taco Sauce",null,{"$f":"\"\"","v":""},"Salad Bar","Shredded Cheddar Cheese","Dinner Roll","Dinner Roll","Ketchup","Cilantro Brown Rice","Taco Sauce",null,{"$f":"\"\"","v":""},"Crispy Cubes & Ketchup","Shredded Cabbage & Cheddar","Dinner Roll","Dinner Roll","Ketchup","Cilantro Brown Rice","Taco Sauce",null,{"$f":"\"\"","v":""},"Salad Bar","RanchaBoom! Sauce","Dinner Roll","Dinner Roll","Ketchup","Cilantro Brown Rice","Taco Sauce",null,{"$f":"\"\"","v":""},"Crispy Cubes & Ketchup",1,"Dinner Roll","Dinner Roll","Ketchup","Cilantro Brown Rice","Taco Sauce & Sour Cream",null,{"$f":"\"\"","v":""},"Salad Bar","Sour Cream","Dinner Roll","Dinner Roll","Ketchup","Cilantro Brown Rice","Taco Sauce & Sour Cream"]
["Week 3",{"$f":"\"\"","v":""},null,"Carrots & Dressing","Corn","Broccoli & Dressing","Assorted Fruit","Assorted Fruit",null,null,{"$f":"\"\"","v":""},"Assorted Fruit","Salad Bar","Salad Bar","Salad Bar","Assorted Chips","Salad Bar","Salad Bar",null,{"$f":"\"\"","v":""},"Assorted Fruit","Shredded Cheddar Cheese","Sweet Potatoes","Coleslaw","Carrots","Broccoli & Dressing","Side Salad & Dressing",null,{"$f":"\"\"","v":""},"Assorted Fruit","Salad Bar","Salad Bar","Salad Bar","Assorted Chips","Salad Bar","Salad Bar",null,{"$f":"\"\"","v":""},"Assorted Fruit","Corn","Sweet Potatoes","Coleslaw","Assorted Chips","Broccoli & Dressing","Side Salad & Dressing",null,{"$f":"\"\"","v":""},"Assorted Fruit","Salad Bar","Salad Bar","Salad Bar","Assorted Chips","Salad Bar","Salad Bar",null,{"$f":"\"\"","v":""},"Side Salad & Dressing","RanchaBoom! Sauce","Sweet Potatoes","Coleslaw & Baked Beans","Assorted Chips","Broccoli & Dressing","Side Salad & Dressing",null,{"$f":"\"\"","v":""},"Assorted Fruit","Salad Bar","Salad Bar","Salad Bar","Assorted Chips","Salad Bar","Salad Bar",null,{"$f":"\"\"","v":""},"Side Salad & Dressing",2,"Assorted Chips","Coleslaw & Baked Beans","Assorted Chips","Broccoli & Dressing","Side Salad & Dressing",null,{"$f":"\"\"","v":""},"Assorted Fruit","RanchaBoom! Sauce","Assorted Chips","Assorted Chips","Assorted Chips","Salad Bar","Shredded Cheddar & Taco Sauce"]
{"$rows_left_out":237}
{"sheet":"Copy","index":2,"n_rows":42,"n_cols":12,"rows_kept":42,"cut":false,"hidden":false,"merged":[[41,0,42,0],[41,1,42,2],[41,3,42,5],[41,6,42,7],[1,1,2,2],[1,3,1,6],[1,7,3,7],[2,3,3,5],[2,6,3,6]]}
["Age Group:","6-8",null,"Salad Bar:","No",null,"Days of School:","7-Day"]
[]
[null,null,null,"Month",null,null,"Year",null,null,{"$f":"DATE($G$3,MONTH(DATEVALUE(D3&\" 1\")),1)","v":{"$error":"#VALUE!"}},{"$f":"TEXT((DATE($G$3,MONTH(DATEVALUE(D3&\" 1\")),1)),\"DDD\")","v":{"$error":"#VALUE!"}}]
[null,null,null,null,null,null,null,null,null,{"$f":"VALUE(TEXT(EOMONTH(J3,0),\"DD\"))","v":{"$error":"#VALUE!"}},{"$f":"MONTH(DATEVALUE(D3&\" 1\"))","v":{"$error":"#VALUE!"}}]
[null,"Sun","Mon","Tue","Wed","Thu","Fri","Sat"]
["Week 1",{"$f":"IFERROR(IF($K$3=B5,1,\"\"),\"\")","v":""},{"$f":"IFERROR(IF($K$3=C5,1,IF(B6=\"\",\"\",B6+1)),\"\")","v":""},"","","","",""]
[]
[null,{"$f":"IFERROR(INDEX('Weeks Calendar'!$C$6:$I$10,2,MATCH(B7,'Weeks Calendar'!$C$6:$I$6,0)),\"\")&\nIFERROR(INDEX('Weeks Calendar'!$C$12:$I$16,2,MATCH(B7,'Weeks Calendar'!$C$12:$I$12,0)),\"\")&\nIFERROR(INDEX('Weeks Calendar'!$C$18:$I$22,2,MATCH(B7,'Weeks Calendar'!$C$18:$I$18,0)),\"\")&\nIFERROR(INDEX('Weeks Calendar'!$C$24:$I$28,2,MATCH(B7,'Weeks Calendar'!$C$24:$I$24,0)),\"\")&\nIFERROR(INDEX('Weeks Calendar'!$C$24:$I$28,2,MATCH(B7,'Weeks Calendar'!$C$30:$I$30,0)),\"\")","v":""},{"$f":"IFERROR(INDEX('Weeks Calendar'!$C$6:$I$10,2,MATCH(C7,'Weeks Calendar'!$C$6:$I$6,0)),\"\")&\nIFERROR(INDEX('Weeks Calendar'!$C$12:$I$16,2,MATCH(C7,'Weeks Calendar'!$C$12:$I$12,0)),\"\")&\nIFERROR(INDEX('Weeks Calendar'!$C$18:$I$22,2,MATCH(C7,'Weeks Calendar'!$C$18:$I$18,0)),\"\")&\nIFERROR(INDEX('Weeks Calendar'!$C$24:$I$28,2,MATCH(C7,'Weeks Calendar'!$C$24:$I$24,0)),\"\")&\nIFERROR(INDEX('Weeks Calendar'!$C$24:$I$28,2,MATCH(C7,'Weeks Calendar'!$C$30:$I$30,0)),\"\")","v":""},{"$f":"IFERROR(INDEX('Weeks Calendar'!$C$6:$I$10,2,MATCH(D7,'Weeks Calendar'!$C$6:$I$6,0)),\"\")&\nIFERROR(INDEX('Weeks Calendar'!$C$12:$I$16,2,MATCH(D7,'Weeks Calendar'!$C$12:$I$12,0)),\"\")&\nIFERROR(INDEX('Weeks Calendar'!$C$18:$I$22,2,MATCH(D7,'Weeks Calendar'!$C$18:$I$18,0)),\"\")&\nIFERROR(INDEX('Weeks Calendar'!$C$24:$I$28,2,MATCH(D7,'Weeks Calendar'!$C$24:$I$24,0)),\"\")&\nIFERROR(INDEX('Weeks Calendar'!$C$24:$I$28,2,MATCH(D7,'Weeks Calendar'!$C$30:$I$30,0)),\"\")","v":""},{"$f":"IFERROR(INDEX('Weeks Calendar'!$C$6:$I$10,2,MATCH(E7,'Weeks Calendar'!$C$6:$I$6,0)),\"\")&\nIFERROR(INDEX('Weeks Calendar'!$C$12:$I$16,2,MATCH(E7,'Weeks Calendar'!$C$12:$I$12,0)),\"\")&\nIFERROR(INDEX('Weeks Calendar'!$C$18:$I$22,2,MATCH(E7,'Weeks Calendar'!$C$18:$I$18,0)),\"\")&\nIFERROR(INDEX('Weeks Calendar'!$C$24:$I$28,2,MATCH(E7,'Weeks Calendar'!$C$24:$I$24,0)),\"\")&\nIFERROR(INDEX('Weeks Calendar'!$C$24:$I$28,2,MATCH(E7,'Weeks Calendar'!$C$30:$I$30,0)),\"\")","v":""},{"$f":"IFERROR(INDEX('Weeks Calendar'!$C$6:$I$10,2,MATCH(F7,'Weeks Calendar'!$C$6:$I$6,0)),\"\")&\nIFERROR(INDEX('Weeks Calendar'!$C$12:$I$16,2,MATCH(F7,'Weeks Calendar'!$C$12:$I$12,0)),\"\")&\nIFERROR(INDEX('Weeks Calendar'!$C$18:$I$22,2,MATCH(F7,'Weeks Calendar'!$C$18:$I$18,0)),\"\")&\nIFERROR(INDEX('Weeks Calendar'!$C$24:$I$28,2,MATCH(F7,'Weeks Calendar'!$C$24:$I$24,0)),\"\")&\nIFERROR(INDEX('Weeks Calendar'!$C$24:$I$28,2,MATCH(F7,'Weeks Calendar'!$C$30:$I$30,0)),\"\")","v":""},{"$f":"IFERROR(INDEX('Weeks Calendar'!$C$6:$I$10,2,MATCH(G7,'Weeks Calendar'!$C$6:$I$6,0)),\"\")&\nIFERROR(INDEX('Weeks Calendar'!$C$12:$I$16,2,MATCH(G7,'Weeks Calendar'!$C$12:$I$12,0)),\"\")&\nIFERROR(INDEX('Weeks Calendar'!$C$18:$I$22,2,MATCH(G7,'Weeks Calendar'!$C$18:$I$18,0)),\"\")&\nIFERROR(INDEX('Weeks Calendar'!$C$24:$I$28,2,MATCH(G7,'Weeks Calendar'!$C$24:$I$24,0)),\"\")&\nIFERROR(INDEX('Weeks Calendar'!$C$24:$I$28,2,MATCH(G7,'Weeks Calendar'!$C$30:$I$30,0)),\"\")","v":""},{"$f":"IFERROR(INDEX('Weeks Calendar'!$C$6:$I$10,2,MATCH(H7,'Weeks Calendar'!$C$6:$I$6,0)),\"\")&\nIFERROR(INDEX('Weeks Calendar'!$C$12:$I$16,2,MATCH(H7,'Weeks Calendar'!$C$12:$I$12,0)),\"\")&\nIFERROR(INDEX('Weeks Calendar'!$C$18:$I$22,2,MATCH(H7,'Weeks Calendar'!$C$18:$I$18,0)),\"\")&\nIFERROR(INDEX('Weeks Calendar'!$C$24:$I$28,2,MATCH(H7,'Weeks Calendar'!$C$24:$I$24,0)),\"\")&\nIFERROR(INDEX('Weeks Calendar'!$C$24:$I$28,2,MATCH(H7,'Weeks Calendar'!$C$30:$I$30,0)),\"\")","v":""},null,null,null,"<<<<Grocery Meals>>>>"]
{"$rows_left_out":34}